{"text_format":"1","workbook":"xlsx","n_sheets":5,"sheets":["紹介依頼書","紹介依頼書 (記入例)","インポートシート","リストシート","データチェック"],"not_rendered":{"charts":0,"images":0,"macros":1,"external_links":3,"defined_names":46,"comments":1,"pivot_tables":0},"unopened":[],"bounds":{"document_bytes":16777216,"sheet_cells":100000,"rows_first":2000,"rows_last":500,"rows_between":2000,"halvings":0,"cell_chars":16384,"cell_head_chars":4096},"cells_cut":0,"cells_raw":0,"read":"whole","date_system":"1900"}

{"sheet":"紹介依頼書","index":0,"n_rows":24,"n_cols":15,"rows_kept":24,"cut":false,"hidden":false,"merged":[[22,1,22,12],[23,1,23,12],[18,1,18,2],[19,1,19,2],[20,1,20,12],[21,1,21,12],[17,3,19,12],[15,1,15,2],[15,3,15,12],[17,1,17,2],[16,5,16,7],[13,6,13,7],[12,1,12,2],[13,1,13,2],[14,1,14,2],[14,6,14,7],[9,1,9,2],[9,3,9,12],[10,1,10,2],[12,6,12,7],[11,1,11,2],[11,3,11,12],[10,3,10,11],[8,1,8,2],[8,3,8,6],[8,8,8,9],[8,10,8,12],[7,3,7,6],[7,8,7,9],[7,10,7,12],[5,1,5,2],[5,8,5,9],[5,10,5,12],[5,4,5,6],[7,1,7,2],[0,0,0,1],[0,2,1,11],[3,1,3,2],[3,3,3,6],[4,1,4,2],[4,3,4,6],[4,10,4,12],[3,10,3,12],[3,8,3,9]]}
["取扱注意",null,"「しずおかスポーツ人材バンク」指導者紹介依頼書\n（指導者紹介依頼書）"]
[]
[null,null,null,null,null,null,null,null,null,null,null,null,"平成 　　年 　　月 　　日"]
[1,"学校名 選択",null,null,null,null,null,2,"校種 選択",null,null,null,null,null,{"$f":"IFERROR(VLOOKUP(D4,リストシート!H3:I434,2,),\"\")","v":""}]
[]
[3,"職名/担当者名",null,null,null,null,null,4,"ふりがな"]
[]
[5,"紹介依頼期間 選択",null,null,null,null,null,6,"紹介依頼期限日"]
[7,"部活動名 選択",null,null,null,null,null,8,"部員総数",null,null,null,null,null,{"$f":"IFERROR(VLOOKUP(D9,リストシート!J3:K58,2,),\"\")","v":""}]
[9,"希望指導形態 選択"]
[10,"希望理由 選択"]
[11,"審判資格 選択"]
[12,"指導可能日時",null,"月曜","火曜","水曜","木曜",null,"金曜","土曜","日曜","祝日","毎日"]
[null," １全日 ２午前"]
[null," ３午後 ４夜間"]
[13,"報酬の希望等 選択"]
[14,"報酬の希望等（謝金を希望する場合）",null,null,null,"1時間あたり",null,null,null,"円程度、交通費は実費"]
[15,"詳細な状況"]
[]
[]
[16]
[null,"　　このバンク登録申請書における個人情報は、個人情報の保護に関する法律(平成15年法律第57号)"]
[null,"　に従い、厳正に取り扱うと共に、バンク登録指導者とのマッチングにおいて、（公財）静岡県体育"]
[null,"　協会の職員が使用するほか、個人が特定されない範囲の情報の一部をＨＰ上に掲載します。"]

{"sheet":"紹介依頼書 (記入例)","index":1,"n_rows":24,"n_cols":13,"rows_kept":24,"cut":false,"hidden":false,"merged":[[0,0,0,1],[0,2,1,11],[3,1,3,2],[3,3,3,6],[3,8,3,9],[3,10,3,12],[4,1,4,2],[4,3,4,6],[4,10,4,12],[5,1,5,2],[5,4,5,6],[5,8,5,9],[5,10,5,12],[7,1,7,2],[7,3,7,6],[7,8,7,9],[7,10,7,12],[8,1,8,2],[8,3,8,6],[8,8,8,9],[8,10,8,12],[9,1,9,2],[9,3,9,12],[10,1,10,2],[10,3,10,11],[11,1,11,2],[11,3,11,12],[12,1,12,2],[12,6,12,7],[13,1,13,2],[13,6,13,7],[14,1,14,2],[14,6,14,7],[20,1,20,12],[21,1,21,12],[22,1,22,12],[23,1,23,12],[15,1,15,2],[15,3,15,12],[16,5,16,7],[17,1,17,2],[17,3,19,12],[18,1,18,2],[19,1,19,2]]}
["取扱注意",null,"「しずおかスポーツ人材バンク」指導者紹介依頼書（記入例）\n（指導者紹介依頼書）"]
[]
[null,null,null,null,null,null,null,null,null,null,null,null,"平成 　　年 　　月 　　日"]
[1,"学校名 選択",null,"松崎",null,null,null,2,"校種 選択",null,"高等学校"]
[]
[3,"職名 担当者名",null,"教諭","静岡太郎",null,null,4,"ふりがな",null,"しずおかたろう"]
[]
[5,"紹介依頼期間 選択",null,"指導者が見つかるまで",null,null,null,6,"紹介依頼期限日",null,"2017-10-01"]
[7,"部活動名 選択",null,"陸上競技",null,null,null,8,"部員総数",null,10]
[9,"希望指導形態 選択",null,"コーチ的指導（顧問の指導をサポートし、生徒に技術指導を主に指導）"]
[10,"希望理由 選択",null,"より高い技術指導を有する地域の指導力を生かすため、教員の負担軽減のため"]
[11,"審判資格 選択",null,"所有は問わない"]
[12,"指導可能日時",null,"月曜","火曜","水曜","木曜",null,"金曜","土曜","日曜","祝日","毎日"]
[null," １全日 ２午前"]
[null," ３午後 ４夜間"]
[13,"報酬の希望等 選択",null,"謝金希望または依頼者と交渉"]
[14,"報酬の希望等（謝金を希望する場合）",null,null,null,"1時間あたり",null,null,1000,"円程度、交通費は実費"]
[15,"詳細な状況"]
[]
[]
[16]
[null,"　　このバンク登録申請書における個人情報は、個人情報の保護に関する法律(平成15年法律第57号)"]
[null,"　に従い、厳正に取り扱うと共に、バンク登録指導者とのマッチングにおいて、（公財）静岡県体育"]
[null,"　協会の職員が使用するほか、個人が特定されない範囲の情報の一部をＨＰ上に掲載します。"]

{"sheet":"インポートシート","index":2,"n_rows":2,"n_cols":28,"rows_kept":2,"cut":false,"hidden":false,"merged":[]}
["ID","依頼番号","提出日","学校ＩＤ","担当職名","氏名","ふりがな","紹介依頼期間区分","紹介依頼期間","競技名","部員数","希望指導形態","希望理由","審判資格区分","月曜","火曜","水曜","木曜","金曜","土曜","日曜","祝日","毎日","報酬","報酬（記載）","報酬TO","詳細状況","情報同意"]
[null,null,null,{"$f":"紹介依頼書!O4","v":""},{"$f":"紹介依頼書!D6","v":0},{"$f":"紹介依頼書!E6","v":0},{"$f":"紹介依頼書!K6","v":0},{"$f":"紹介依頼書!D8","v":0},{"$f":"紹介依頼書!K8","v":0},{"$f":"紹介依頼書!O9","v":""},{"$f":"紹介依頼書!K9","v":0},{"$f":"紹介依頼書!D10","v":0},null,{"$f":"紹介依頼書!D12","v":0},{"$f":"データチェック!H4","v":""},{"$f":"データチェック!H5","v":""},{"$f":"データチェック!H6","v":""},{"$f":"データチェック!H7","v":""},{"$f":"データチェック!H8","v":""},{"$f":"データチェック!H9","v":""},{"$f":"データチェック!H10","v":""},{"$f":"データチェック!H11","v":""},{"$f":"データチェック!H12","v":""},{"$f":"紹介依頼書!D16","v":0},null,{"$f":"紹介依頼書!I17","v":0},{"$f":"紹介依頼書!D18","v":0},{"$f":"データチェック!H14","v":""}]

{"sheet":"リストシート","index":3,"n_rows":434,"n_cols":13,"rows_kept":434,"cut":false,"hidden":false,"merged":[]}
["担当職名","依頼区分","指導形態","希望理由","審判資格","依頼時間","報酬","学校名","ID","競技名","ID","校種","情報同意"]
[]
["校長","指導者が見つかるまで","監督的な指導（日常活動から公式試合まで全ての指導）","技術指導ができる教員がいないため","所有を希望する","全日","謝金の用意がある","下田",1,"陸上競技",1,"高等学校","同意する"]
["副校長","期間指定","コーチ的指導（顧問の指導をサポートし、生徒に技術指導を主に指導）","より高い技術指導を有する地域の指導力を生かすため","所有は問わない","午前","指導者と交渉","南伊豆分校",2,"競泳",2,"中学校"]
["教頭",null,"アドバイザー的指導（部活動運営等、顧問へのアドバイス）","生徒・保護者からの要望があるため",null,"午後","ボランティア","松崎",3,"飛込",3]
["教諭",null,null,"教員の負担軽減のため",null,"夜間",null,"稲取",4,"水球",4]
["講師",null,null,"その他",null,"午前・午後",null,"伊東",5,"シンクロナイズドスイミング",5]
["その他",null,null,null,null,"午後・夜間",null,"城ヶ崎分校",6,"オープンウォータースイミング",6]
[null,null,null,null,null,"午前・夜間",null,"伊東商業",7,"テニス",7]
[null,null,null,null,null,null,null,"土肥分校",8,"ソフトテニス",8]
[null,null,null,null,null,null,null,"伊豆総合",9,"バドミントン",9]
[null,null,null,null,null,null,null,"熱海",10,"体操",10]
[null,null,null,null,null,null,null,"韮山",11,"新体操",11]
[null,null,null,null,null,null,null,"伊豆中央",12,"トランポリン",12]
[null,null,null,null,null,null,null,"田方農業",13,"卓球",13]
[null,null,null,null,null,null,null,"三島南",14,"バレーボール",14]
[null,null,null,null,null,null,null,"三島北",15,"バスケットボール",15]
[null,null,null,null,null,null,null,"三島長陵",16,"サッカー",16]
[null,null,null,null,null,null,null,"日本大学\n三島",17,"ハンドボール",17]
[null,null,null,null,null,null,null,"小山",18,"軟式野球",18]
[null,null,null,null,null,null,null,"御殿場",19,"硬式野球",19]
[null,null,null,null,null,null,null,"御殿場南",20,"ソフトボール",20]
[null,null,null,null,null,null,null,"御殿場西",21,"ラクビーフットボール",21]
[null,null,null,null,null,null,null,"裾野",22,"剣道",22]
[null,null,null,null,null,null,null,"不二聖心\n女子学院",23,"柔道",23]
[null,null,null,null,null,null,null,"知徳",24,"相撲",24]
[null,null,null,null,null,null,null,"沼津東",25,"弓道",25]
[null,null,null,null,null,null,null,"沼津西",26,"空手道",26]
[null,null,null,null,null,null,null,"沼津城北",27,"登山",27]
[null,null,null,null,null,null,null,"沼津工業",28,"ボート",28]
[null,null,null,null,null,null,null,"沼津商業",29,"カヌー",29]
[null,null,null,null,null,null,null,"沼津市立",30,"ヨット",30]
[null,null,null,null,null,null,null,"沼津中央",31,"ウェイトリフティング",31]
[null,null,null,null,null,null,null,"飛龍",32,"フェンシング",32]
[null,null,null,null,null,null,null,"桐陽",33,"レスリング",33]
[null,null,null,null,null,null,null,"加藤学園",34,"なぎなた",34]
[null,null,null,null,null,null,null,"加藤学園\n暁秀",35,"自転車",35]
[null,null,null,null,null,null,null,"誠恵",36,"ホッケー",36]
[null,null,null,null,null,null,null,"吉原",37,"ボクシング",37]
[null,null,null,null,null,null,null,"吉原工業",38,"アーチェリー",38]
[null,null,null,null,null,null,null,"富士",39,"スケート",39]
[null,null,null,null,null,null,null,"富士東",40,"スキー",40]
[null,null,null,null,null,null,null,"富士市立",41,"アイスホッケー",41]
[null,null,null,null,null,null,null,"静岡県\n富士見",42,"少林寺拳法",42]
[null,null,null,null,null,null,null,"富士宮東",43,"ボウリング",43]
[null,null,null,null,null,null,null,"富士宮北",44,"馬術",44]
[null,null,null,null,null,null,null,"富士宮西",45,"ゴルフ",45]
[null,null,null,null,null,null,null,"富岳館",46,"クレー射撃",46]
[null,null,null,null,null,null,null,"星陵",47,"ライフル射撃",47]
[null,null,null,null,null,null,null,"清水東",48,"銃剣道",48]
[null,null,null,null,null,null,null,"清水西",49,"トライスロン",49]
[null,null,null,null,null,null,null,"清水南",50,"綱引",50]
[null,null,null,null,null,null,null,"清水桜が丘",51,"ゲートボール",51]
[null,null,null,null,null,null,null,"清水国際",52,"パワーリフティング",52]
[null,null,null,null,null,null,null,"静岡\nサレジオ",53,"グラウンド・ゴルフ",53]
[null,null,null,null,null,null,null,"東海大学付属\n静岡翔洋　　",54,"武術太極拳",54]
[null,null,null,null,null,null,null,"静岡",55,"ダンススポーツ",55]
[null,null,null,null,null,null,null,"静岡城北",56,"バウンドテニス",56]
[null,null,null,null,null,null,null,"静岡東",57]
[null,null,null,null,null,null,null,"静岡西",58]
[null,null,null,null,null,null,null,"静岡農業",59]
[null,null,null,null,null,null,null,"科学技術",60]
[null,null,null,null,null,null,null,"静岡商業",61]
[null,null,null,null,null,null,null,"静岡市立",62]
[null,null,null,null,null,null,null,"静岡大成",63]
[null,null,null,null,null,null,null,"静岡北",64]
[null,null,null,null,null,null,null,"静岡雙葉",65]
[null,null,null,null,null,null,null,"静岡英和\n女学院",66]
[null,null,null,null,null,null,null,"常葉大学附属常葉",67]
[null,null,null,null,null,null,null,"静岡学園",68]
[null,null,null,null,null,null,null,"常葉大学附属橘",69]
[null,null,null,null,null,null,null,"駿河総合",70]
[null,null,null,null,null,null,null,"静岡女子",71]
[null,null,null,null,null,null,null,"城南静岡",72]
[null,null,null,null,null,null,null,"静岡聖光\n学院",73]
[null,null,null,null,null,null,null,"焼津中央",74]
[null,null,null,null,null,null,null,"焼津水産",75]
[null,null,null,null,null,null,null,"清流館",76]
[null,null,null,null,null,null,null,"焼津",77]
[null,null,null,null,null,null,null,"藤枝東",78]
[null,null,null,null,null,null,null,"藤枝西",79]
[null,null,null,null,null,null,null,"藤枝北",80]
[null,null,null,null,null,null,null,"静清",81]
[null,null,null,null,null,null,null,"藤枝順心",82]
[null,null,null,null,null,null,null,"藤枝明誠",83]
[null,null,null,null,null,null,null,"島田",84]
[null,null,null,null,null,null,null,"島田工業",85]
[null,null,null,null,null,null,null,"島田商業",86]
[null,null,null,null,null,null,null,"金谷",87]
[null,null,null,null,null,null,null,"島田樟誠",88]
[null,null,null,null,null,null,null,"川根",89]
[null,null,null,null,null,null,null,"榛原",90]
[null,null,null,null,null,null,null,"相良",91]
[null,null,null,null,null,null,null,"池新田",92]
[null,null,null,null,null,null,null,"小笠",93]
[null,null,null,null,null,null,null,"常葉大学附属菊川",94]
[null,null,null,null,null,null,null,"菊川南陵",95]
[null,null,null,null,null,null,null,"掛川東",96]
[null,null,null,null,null,null,null,"掛川西",97]
[null,null,null,null,null,null,null,"掛川工業",98]
[null,null,null,null,null,null,null,"横須賀",99]
[null,null,null,null,null,null,null,"遠江総合",100]
[null,null,null,null,null,null,null,"袋井",101]
[null,null,null,null,null,null,null,"袋井商業",102]
[null,null,null,null,null,null,null,"磐田南",103]
[null,null,null,null,null,null,null,"磐田北",104]
[null,null,null,null,null,null,null,"磐田農業",105]
[null,null,null,null,null,null,null,"磐田西",106]
[null,null,null,null,null,null,null,"磐田東",107]
[null,null,null,null,null,null,null,"天竜",108]
[null,null,null,null,null,null,null,"春野校舎",109]
[null,null,null,null,null,null,null,"佐久間分校",110]
[null,null,null,null,null,null,null,"浜名",111]
[null,null,null,null,null,null,null,"浜北西",112]
[null,null,null,null,null,null,null,"浜松工業",113]
[null,null,null,null,null,null,null,"浜松湖北",114]
[null,null,null,null,null,null,null,"聖隷\nｸﾘｽﾄﾌｧｰ",115]
[null,null,null,null,null,null,null,"浜松啓陽",116]
[null,null,null,null,null,null,null,"浜松東",117]
[null,null,null,null,null,null,null,"浜松日体",118]
[null,null,null,null,null,null,null,"浜松北",119]
[null,null,null,null,null,null,null,"浜松西",120]
[null,null,null,null,null,null,null,"浜松城北工業",121]
[null,null,null,null,null,null,null,"浜松商業",122]
[null,null,null,null,null,null,null,"浜松市立",123]
[null,null,null,null,null,null,null,"浜松学院",124]
[null,null,null,null,null,null,null,"浜松開誠館",125]
[null,null,null,null,null,null,null,"浜松修学舎",126]
[null,null,null,null,null,null,null,"浜松学芸",127]
[null,null,null,null,null,null,null,"浜松聖星",128]
[null,null,null,null,null,null,null,"静岡県西遠\n女子学園",129]
[null,null,null,null,null,null,null,"浜松南",130]
[null,null,null,null,null,null,null,"浜松江之島",131]
[null,null,null,null,null,null,null,"浜松湖東",132]
[null,null,null,null,null,null,null,"浜松湖南",133]
[null,null,null,null,null,null,null,"浜松大平台",134]
[null,null,null,null,null,null,null,"オイスカ",135]
[null,null,null,null,null,null,null,"新居",136]
[null,null,null,null,null,null,null,"湖西",137]
[null,null,null,null,null,null,null,"稲梓",138]
[null,null,null,null,null,null,null,"稲生沢",139]
[null,null,null,null,null,null,null,"下田東",140]
[null,null,null,null,null,null,null,"下田",141]
[null,null,null,null,null,null,null,"南伊豆東",142]
[null,null,null,null,null,null,null,"南伊豆",143]
[null,null,null,null,null,null,null,"松崎",144]
[null,null,null,null,null,null,null,"稲取",145]
[null,null,null,null,null,null,null,"熱川",146]
[null,null,null,null,null,null,null,"河津",147]
[null,null,null,null,null,null,null,"西伊豆",148]
[null,null,null,null,null,null,null,"賀茂",149]
[null,null,null,null,null,null,null,"(伊東)南",150]
[null,null,null,null,null,null,null,"(伊東)北",151]
[null,null,null,null,null,null,null,"宇佐美",152]
[null,null,null,null,null,null,null,"対馬",153]
[null,null,null,null,null,null,null,"門野",154]
[null,null,null,null,null,null,null,"修善寺",155]
[null,null,null,null,null,null,null,"土肥",156]
[null,null,null,null,null,null,null,"天城",157]
[null,null,null,null,null,null,null,"中伊豆",158]
[null,null,null,null,null,null,null,"初島",159]
[null,null,null,null,null,null,null,"多賀",160]
[null,null,null,null,null,null,null,"泉",161]
[null,null,null,null,null,null,null,"熱海",162]
[null,null,null,null,null,null,null,"長岡",163]
[null,null,null,null,null,null,null,"韮山",164]
[null,null,null,null,null,null,null,"大仁",165]
[null,null,null,null,null,null,null,"函南",166]
[null,null,null,null,null,null,null,"(函南)東",167]
[null,null,null,null,null,null,null,"(三島)南",168]
[null,null,null,null,null,null,null,"(三島)北",169]
[null,null,null,null,null,null,null,"中郷",170]
[null,null,null,null,null,null,null,"錦田",171]
[null,null,null,null,null,null,null,"北上",172]
[null,null,null,null,null,null,null,"中郷西",173]
[null,null,null,null,null,null,null,"山田",174]
[null,null,null,null,null,null,null,"日本大学三島",175]
[null,null,null,null,null,null,null,"小山",176]
[null,null,null,null,null,null,null,"北郷",177]
[null,null,null,null,null,null,null,"須走",178]
[null,null,null,null,null,null,null,"御殿場",179]
[null,null,null,null,null,null,null,"富士岡",180]
[null,null,null,null,null,null,null,"原里",181]
[null,null,null,null,null,null,null,"(御殿場)西",182]
[null,null,null,null,null,null,null,"高根",183]
[null,null,null,null,null,null,null,"(御殿場)南",184]
[null,null,null,null,null,null,null,"(裾野)東",185]
[null,null,null,null,null,null,null,"(裾野)西",186]
[null,null,null,null,null,null,null,"深良",187]
[null,null,null,null,null,null,null,"富岡",188]
[null,null,null,null,null,null,null,"須山",189]
[null,null,null,null,null,null,null,"不二聖心女子学院",190]
[null,null,null,null,null,null,null,"清水",191]
[null,null,null,null,null,null,null,"(清水)南",192]
[null,null,null,null,null,null,null,"長泉",193]
[null,null,null,null,null,null,null,"(長泉)北",194]
[null,null,null,null,null,null,null,"第一",195]
[null,null,null,null,null,null,null,"第二",196]
[null,null,null,null,null,null,null,"第三",197]
[null,null,null,null,null,null,null,"第四",198]
[null,null,null,null,null,null,null,"第五",199]
[null,null,null,null,null,null,null,"片浜",200]
[null,null,null,null,null,null,null,"金岡",201]
[null,null,null,null,null,null,null,"大岡",202]
[null,null,null,null,null,null,null,"静浦",203]
[null,null,null,null,null,null,null,"愛鷹",204]
[null,null,null,null,null,null,null,"大平",205]
[null,null,null,null,null,null,null,"今沢",206]
[null,null,null,null,null,null,null,"門池",207]
[null,null,null,null,null,null,null,"市立沼津",208]
[null,null,null,null,null,null,null,"戸田",209]
[null,null,null,null,null,null,null,"原",210]
[null,null,null,null,null,null,null,"浮島",211]
[null,null,null,null,null,null,null,"長井崎",212]
[null,null,null,null,null,null,null,"加藤学園暁秀",213]
[null,null,null,null,null,null,null,"吉原第一",214]
[null,null,null,null,null,null,null,"吉原第二",215]
[null,null,null,null,null,null,null,"吉原第三",216]
[null,null,null,null,null,null,null,"吉原東",217]
[null,null,null,null,null,null,null,"元吉原",218]
[null,null,null,null,null,null,null,"須津",219]
[null,null,null,null,null,null,null,"大淵",220]
[null,null,null,null,null,null,null,"富士",221]
[null,null,null,null,null,null,null,"富士南",222]
[null,null,null,null,null,null,null,"田子浦",223]
[null,null,null,null,null,null,null,"岩松",224]
[null,null,null,null,null,null,null,"鷹岡",225]
[null,null,null,null,null,null,null,"(富士)岳陽",226]
[null,null,null,null,null,null,null,"吉原北",227]
[null,null,null,null,null,null,null,"富士川第一",228]
[null,null,null,null,null,null,null,"富士川第二",229]
[null,null,null,null,null,null,null,"静岡県富士見",230]
[null,null,null,null,null,null,null,"富士宮第一",231]
[null,null,null,null,null,null,null,"富士宮第二",232]
[null,null,null,null,null,null,null,"富士宮第三",233]
[null,null,null,null,null,null,null,"富士宮第四",234]
[null,null,null,null,null,null,null,"富士根南",235]
[null,null,null,null,null,null,null,"富士根北",236]
[null,null,null,null,null,null,null,"北山",237]
[null,null,null,null,null,null,null,"西富士",238]
[null,null,null,null,null,null,null,"井之頭",239]
[null,null,null,null,null,null,null,"上野",240]
[null,null,null,null,null,null,null,"大富士",241]
[null,null,null,null,null,null,null,"芝川",242]
[null,null,null,null,null,null,null,"柚野",243]
[null,null,null,null,null,null,null,"星陵",244]
[null,null,null,null,null,null,null,"清水第一",245]
[null,null,null,null,null,null,null,"清水第二",246]
[null,null,null,null,null,null,null,"清水第三",247]
[null,null,null,null,null,null,null,"清水第四",248]
[null,null,null,null,null,null,null,"清水第五",249]
[null,null,null,null,null,null,null,"清水第六",250]
[null,null,null,null,null,null,null,"清水第七",251]
[null,null,null,null,null,null,null,"清水第八",252]
[null,null,null,null,null,null,null,"清水袖師",253]
[null,null,null,null,null,null,null,"清水庵原",254]
[null,null,null,null,null,null,null,"清水興津",255]
[null,null,null,null,null,null,null,"清水小島",256]
[null,null,null,null,null,null,null,"清水両河内",257]
[null,null,null,null,null,null,null,"清水飯田",258]
[null,null,null,null,null,null,null,"蒲原",259]
[null,null,null,null,null,null,null,"由比",260]
[null,null,null,null,null,null,null,"清水南",261]
[null,null,null,null,null,null,null,"静岡サレジオ",262]
[null,null,null,null,null,null,null,"東海大学付属静岡翔洋",263]
[null,null,null,null,null,null,null,"籠上",264]
[null,null,null,null,null,null,null,"末広",265]
[null,null,null,null,null,null,null,"城内",266]
[null,null,null,null,null,null,null,"安東",267]
[null,null,null,null,null,null,null,"(静岡)東",268]
[null,null,null,null,null,null,null,"賤機",269]
[null,null,null,null,null,null,null,"西奈",270]
[null,null,null,null,null,null,null,"安倍川",271]
[null,null,null,null,null,null,null,"美和",272]
[null,null,null,null,null,null,null,"服織",273]
[null,null,null,null,null,null,null,"藁科",274]
[null,null,null,null,null,null,null,"観山",275]
[null,null,null,null,null,null,null,"大河内",276]
[null,null,null,null,null,null,null,"梅ヶ島",277]
[null,null,null,null,null,null,null,"玉川",278]
[null,null,null,null,null,null,null,"井川小",279]
[null,null,null,null,null,null,null,"大川",280]
[null,null,null,null,null,null,null,"竜爪",281]
[null,null,null,null,null,null,null,"付属静岡",282]
[null,null,null,null,null,null,null,"静岡大成",283]
[null,null,null,null,null,null,null,"静岡北",284]
[null,null,null,null,null,null,null,"静岡雙葉",285]
[null,null,null,null,null,null,null,"静岡英和女学院",286]
[null,null,null,null,null,null,null,"常葉大学附属常葉",287]
[null,null,null,null,null,null,null,"静岡学園",288]
[null,null,null,null,null,null,null,"常葉大学附属橘",289]
[null,null,null,null,null,null,null,"大里",290]
[null,null,null,null,null,null,null,"(静岡)豊田",291]
[null,null,null,null,null,null,null,"東豊田",292]
[null,null,null,null,null,null,null,"高松",293]
[null,null,null,null,null,null,null,"長田西",294]
[null,null,null,null,null,null,null,"長田南",295]
[null,null,null,null,null,null,null,"(静岡)南",296]
[null,null,null,null,null,null,null,"(静岡)城山",297]
[null,null,null,null,null,null,null,"中島",298]
[null,null,null,null,null,null,null,"城南静岡",299]
[null,null,null,null,null,null,null,"静岡聖光学院",300]
[null,null,null,null,null,null,null,"焼津",301]
[null,null,null,null,null,null,null,"大村",302]
[null,null,null,null,null,null,null,"(焼津)豊田",303]
[null,null,null,null,null,null,null,"小川",304]
[null,null,null,null,null,null,null,"東益津",305]
[null,null,null,null,null,null,null,"大富",306]
[null,null,null,null,null,null,null,"和田",307]
[null,null,null,null,null,null,null,"港",308]
[null,null,null,null,null,null,null,"大井川",309]
[null,null,null,null,null,null,null,"藤枝",310]
[null,null,null,null,null,null,null,"西益津",311]
[null,null,null,null,null,null,null,"青島",312]
[null,null,null,null,null,null,null,"葉梨",313]
[null,null,null,null,null,null,null,"高洲",314]
[null,null,null,null,null,null,null,"大洲",315]
[null,null,null,null,null,null,null,"瀬戸谷",316]
[null,null,null,null,null,null,null,"広幡",317]
[null,null,null,null,null,null,null,"青島北",318]
[null,null,null,null,null,null,null,"岡部",319]
[null,null,null,null,null,null,null,"藤枝順心",320]
[null,null,null,null,null,null,null,"藤枝明誠",321]
[null,null,null,null,null,null,null,"島田第一",322]
[null,null,null,null,null,null,null,"島田第二",323]
[null,null,null,null,null,null,null,"六合",324]
[null,null,null,null,null,null,null,"初倉",325]
[null,null,null,null,null,null,null,"(島田)北",326]
[null,null,null,null,null,null,null,"金谷",327]
[null,null,null,null,null,null,null,"川根",328]
[null,null,null,null,null,null,null,"付属島田",329]
[null,null,null,null,null,null,null,"中川根",330]
[null,null,null,null,null,null,null,"本川根",331]
[null,null,null,null,null,null,null,"吉田",332]
[null,null,null,null,null,null,null,"相良",333]
[null,null,null,null,null,null,null,"牧之原",334]
[null,null,null,null,null,null,null,"榛原",335]
[null,null,null,null,null,null,null,"御前崎",336]
[null,null,null,null,null,null,null,"浜岡",337]
[null,null,null,null,null,null,null,"(菊川)岳洋",338]
[null,null,null,null,null,null,null,"菊川西",339]
[null,null,null,null,null,null,null,"菊川東",340]
[null,null,null,null,null,null,null,"常葉大学附属菊川",341]
[null,null,null,null,null,null,null,"栄川",342]
[null,null,null,null,null,null,null,"(掛川)東",343]
[null,null,null,null,null,null,null,"(掛川)西",344]
[null,null,null,null,null,null,null,"桜が丘",345]
[null,null,null,null,null,null,null,"原野谷",346]
[null,null,null,null,null,null,null,"(掛川)北",347]
[null,null,null,null,null,null,null,"城東",348]
[null,null,null,null,null,null,null,"大須賀",349]
[null,null,null,null,null,null,null,"大浜",350]
[null,null,null,null,null,null,null,"旭が丘",351]
[null,null,null,null,null,null,null,"森",352]
[null,null,null,null,null,null,null,"泉陽",353]
[null,null,null,null,null,null,null,"袋井",354]
[null,null,null,null,null,null,null,"周南",355]
[null,null,null,null,null,null,null,"袋井南",356]
[null,null,null,null,null,null,null,"浅羽",357]
[null,null,null,null,null,null,null,"磐田第一",358]
[null,null,null,null,null,null,null,"(磐田)城山",359]
[null,null,null,null,null,null,null,"向陽",360]
[null,null,null,null,null,null,null,"神明",361]
[null,null,null,null,null,null,null,"(磐田)南部",362]
[null,null,null,null,null,null,null,"福田",363]
[null,null,null,null,null,null,null,"竜洋",364]
[null,null,null,null,null,null,null,"(磐田)豊田",365]
[null,null,null,null,null,null,null,"豊田南",366]
[null,null,null,null,null,null,null,"豊岡",367]
[null,null,null,null,null,null,null,"磐田東",368]
[null,null,null,null,null,null,null,"清竜",369]
[null,null,null,null,null,null,null,"光が丘",370]
[null,null,null,null,null,null,null,"春野",371]
[null,null,null,null,null,null,null,"佐久間",372]
[null,null,null,null,null,null,null,"水窪",373]
[null,null,null,null,null,null,null,"浜名",374]
[null,null,null,null,null,null,null,"北浜",375]
[null,null,null,null,null,null,null,"浜北北部",376]
[null,null,null,null,null,null,null,"麁玉",377]
[null,null,null,null,null,null,null,"北浜東部",378]
[null,null,null,null,null,null,null,"北星",379]
[null,null,null,null,null,null,null,"都田",380]
[null,null,null,null,null,null,null,"三方原",381]
[null,null,null,null,null,null,null,"細江",382]
[null,null,null,null,null,null,null,"引佐北部",383]
[null,null,null,null,null,null,null,"引佐南部",384]
[null,null,null,null,null,null,null,"三ケ日",385]
[null,null,null,null,null,null,null,"聖隷クリストファー",386]
[null,null,null,null,null,null,null,"天竜",387]
[null,null,null,null,null,null,null,"与進",388]
[null,null,null,null,null,null,null,"笠井",389]
[null,null,null,null,null,null,null,"積志",390]
[null,null,null,null,null,null,null,"丸塚",391]
[null,null,null,null,null,null,null,"中郡",392]
[null,null,null,null,null,null,null,"積穂",393]
[null,null,null,null,null,null,null,"萩原分校",394]
[null,null,null,null,null,null,null,"浜松日体",395]
[null,null,null,null,null,null,null,"西部",396]
[null,null,null,null,null,null,null,"(浜松)南部",397]
[null,null,null,null,null,null,null,"北部",398]
{"$rows_left_out":35}
{"sheet":"データチェック","index":4,"n_rows":15,"n_cols":8,"rows_kept":15,"cut":false,"hidden":false,"merged":[[0,2,0,5]]}
[null,null,"チェックボックスの判定",null,null,null,null,"インポートシートへの反映"]
[]
["指導可能日時",null,"全日","午前","午後","夜間"]
[null,"月",false,false,false,false,null,{"$f":"IF(C4=TRUE,\"全日;\",\"\")&IF(D4=TRUE,\"午前;\",\"\")&IF(E4=TRUE,\"午後;\",\"\")&IF(F4=TRUE,\"夜間;\",\"\")","v":""}]
[null,"火",false,false,false,false,null,{"$f":"IF(C5=TRUE,\"全日;\",\"\")&IF(D5=TRUE,\"午前;\",\"\")&IF(E5=TRUE,\"午後;\",\"\")&IF(F5=TRUE,\"夜間;\",\"\")","v":""}]
[null,"水",false,false,false,false,null,""]
[null,"木",false,false,false,false,null,""]
[null,"金",false,false,false,false,null,""]
[null,"土",false,false,false,false,null,""]
[null,"日",false,false,false,false,null,""]
[null,"祝",false,false,false,false,null,""]
[null,"毎日",false,false,false,false,null,""]
[]
["情報公開","同意する",false,null,null,null,null,{"$f":"IF(C14=TRUE,\"同意する\",\"\")","v":""}]
[null,"同意しない",false]